[INFO] Scanning for projects...
[INFO] 
[INFO] ------------------< com.homannsoftware:modulith-ddd >-------------------
[INFO] Building modulith-ddd 1.0.0
[INFO]   from pom.xml
[INFO] --------------------------------[ jar ]---------------------------------
[INFO] 
[INFO] --- resources:3.5.0:resources (default-resources) @ modulith-ddd ---
[INFO] Copying 1 resource from src\main\resources to target\classes
[INFO] Copying 1 resource from src\main\resources to target\classes
[INFO] 
[INFO] --- compiler:3.15.0:compile (default-compile) @ modulith-ddd ---
[INFO] Recompiling the module because of changed source code.
[INFO] Compiling 8 source files with javac [debug parameters release 21] to target\classes
[INFO] Die Annotationsverarbeitung ist aktiviert, da mindestens ein Prozessor im
  Classpath gefunden wurde. In einem zuk�nftigen Release von javac kann die Annotationsverarbeitung deaktiviert werden,
  es sei denn, mindestens ein Prozessor ist namentlich angegeben (-processor), oder ein Suchpfad
  ist angegeben (--processor-path, --processor-module-path), oder die Annotationsverarbeitung
  wurde explizit aktiviert (-proc:only, -proc:full).
  Verwenden Sie "-Xlint:-options", um diese Meldung zu unterdr�cken.
  Verwenden Sie "-proc:none", um die Annotationsverarbeitung zu deaktivieren.
[INFO] Extracting Javadoc into D:\CodexProjects\homannsoftware_com\blog\2026-10-09-spring-modulith-ddd\examples\.\target\generated-spring-modulith\javadoc.json.
[INFO] 
[INFO] --- resources:3.5.0:testResources (default-testResources) @ modulith-ddd ---
[INFO] skip non existing resourceDirectory D:\CodexProjects\homannsoftware_com\blog\2026-10-09-spring-modulith-ddd\examples\src\test\resources
[INFO] 
[INFO] --- compiler:3.15.0:testCompile (default-testCompile) @ modulith-ddd ---
[INFO] Recompiling the module because of changed dependency.
[INFO] Compiling 4 source files with javac [debug parameters release 21] to target\test-classes
[INFO] Die Annotationsverarbeitung ist aktiviert, da mindestens ein Prozessor im
  Classpath gefunden wurde. In einem zuk�nftigen Release von javac kann die Annotationsverarbeitung deaktiviert werden,
  es sei denn, mindestens ein Prozessor ist namentlich angegeben (-processor), oder ein Suchpfad
  ist angegeben (--processor-path, --processor-module-path), oder die Annotationsverarbeitung
  wurde explizit aktiviert (-proc:only, -proc:full).
  Verwenden Sie "-Xlint:-options", um diese Meldung zu unterdr�cken.
  Verwenden Sie "-proc:none", um die Annotationsverarbeitung zu deaktivieren.
[INFO] 
[INFO] --- surefire:3.5.6:test (default-test) @ modulith-ddd ---
[INFO] Using auto detected provider org.apache.maven.surefire.junitplatform.JUnitPlatformProvider
[INFO] 
[INFO] -------------------------------------------------------
[INFO]  T E S T S
[INFO] -------------------------------------------------------
[INFO] Running com.homannsoftware.shop.ArchitectureTest
12:38:47.594 [main] INFO com.tngtech.archunit.core.PluginLoader -- Detected Java version 21.0.11
[ERROR] Tests run: 1, Failures: 0, Errors: 1, Skipped: 0, Time elapsed: 1.977 s <<< FAILURE! -- in com.homannsoftware.shop.ArchitectureTest
[ERROR] com.homannsoftware.shop.ArchitectureTest.boundariesAndDocumentation -- Time elapsed: 1.952 s <<< ERROR!
org.springframework.modulith.core.Violations: - Module 'billing' depends on module 'orders' via com.homannsoftware.shop.billing.internal.InvoiceListener -> com.homannsoftware.shop.orders.OrderManagement. Allowed targets: orders :: events.
	at org.springframework.modulith.core.Violations.and(Violations.java:141)
	at org.springframework.modulith.core.ApplicationModules.detectViolations(ApplicationModules.java:497)
	at org.springframework.modulith.core.ApplicationModules.verify(ApplicationModules.java:451)
	at org.springframework.modulith.core.ApplicationModules.verify(ApplicationModules.java:435)
	at com.homannsoftware.shop.ArchitectureTest.boundariesAndDocumentation(ArchitectureTest.java:9)

[INFO] 
[INFO] Results:
[INFO] 
[ERROR] Errors: 
[ERROR]   ArchitectureTest.boundariesAndDocumentation:9 � Violations - Module 'billing' depends on module 'orders' via com.homannsoftware.shop.billing.internal.InvoiceListener -> com.homannsoftware.shop.orders.OrderManagement. Allowed targets: orders :: events.
[INFO] 
[ERROR] Tests run: 1, Failures: 0, Errors: 1, Skipped: 0
[INFO] 
[INFO] ------------------------------------------------------------------------
[INFO] BUILD FAILURE
[INFO] ------------------------------------------------------------------------
[INFO] Total time:  6.778 s
[INFO] Finished at: 2026-10-09T12:38:49+02:00
[INFO] ------------------------------------------------------------------------
[ERROR] Failed to execute goal org.apache.maven.plugins:maven-surefire-plugin:3.5.6:test (default-test) on project modulith-ddd: 
[ERROR] 
[ERROR] See D:\CodexProjects\homannsoftware_com\blog\2026-10-09-spring-modulith-ddd\examples\target\surefire-reports for the individual test results.
[ERROR] See dump files (if any exist) [date].dump, [date]-jvmRun[N].dump and [date].dumpstream.
[ERROR] -> [Help 1]
[ERROR] 
[ERROR] To see the full stack trace of the errors, re-run Maven with the -e switch.
[ERROR] Re-run Maven using the -X switch to enable full debug logging.
[ERROR] 
[ERROR] For more information about the errors and possible solutions, please read the following articles:
[ERROR] [Help 1] http://cwiki.apache.org/confluence/display/MAVEN/MojoFailureException
